{"text_format":"1","workbook":"xlsx","n_sheets":9,"sheets":["Overview","Sheet Validation","1. Staff costs","2-3. Travel Costs&Costs of Stay","4. Equipment Costs","5. Subcontracting Costs","Co-financing","Breakdown & Project Funding","Unit Costs & Funding Rule"],"not_rendered":{"charts":0,"images":2,"macros":1,"external_links":0,"defined_names":39,"comments":0,"pivot_tables":0},"unopened":[],"bounds":{"document_bytes":16777216,"sheet_cells":100000,"rows_first":2000,"rows_last":500,"rows_between":2000,"halvings":0,"cell_chars":16384,"cell_head_chars":4096},"cells_cut":0,"cells_raw":0,"read":"whole","date_system":"1900"}

{"sheet":"Overview","index":0,"n_rows":80,"n_cols":11,"rows_kept":80,"cut":false,"hidden":false,"merged":[[12,1,12,2],[15,1,15,10],[16,1,16,2],[12,4,12,10],[11,4,11,10],[13,1,13,2],[13,3,13,10],[16,8,16,10],[16,4,16,7],[6,1,6,10],[7,1,7,10],[8,1,8,10],[10,1,10,2],[11,1,11,2],[10,4,10,10],[23,1,23,10],[17,1,17,2],[18,1,18,2],[19,1,19,2],[20,1,20,2],[21,1,21,2],[20,4,20,7],[20,8,20,10],[21,4,21,7],[21,8,21,10],[17,4,17,7],[18,4,18,7],[19,4,19,7],[19,8,19,10],[18,8,18,10],[17,8,17,10]]}
[]
[]
[null,null,null,"Key Action 2: Cooperation for innovation and the exchange of good practices"]
[null,null,null,"Capacity Building in the field of higher education"]
[]
[]
[null,"Before completing this table please read carefully the instructions available on the EACEA website"]
[null,"CALL FOR PROPOSALS 2018 – EAC/A05/2017 - Erasmus+ Programme (2017/C 361/04)"]
[null,"Programme guide and instructions for applicants"]
[]
{"$rows_left_out":71}
{"sheet":"Sheet Validation","index":1,"n_rows":7,"n_cols":2,"rows_kept":7,"cut":false,"hidden":true,"merged":[]}
["Data Sheet Validation"]
["1. Staff Costs",{"$f":"IF(COUNTIF('1. Staff costs'!T:T,\"Error\")<=1,\"OK\",\"Please check data in Tab '\"&A2&\"'\")","v":"OK"}]
["2-3. Travel Costs&Costs of Stay",{"$f":"IF(COUNTIF('2-3. Travel Costs&Costs of Stay'!O:O,\"Error\")<=1,\"OK\",\"Please check data in Tab '\"&A3&\"'\")","v":"OK"}]
["4. Equipment Costs",{"$f":"IF(COUNTIF('4. Equipment Costs'!I:T,\"Error\")<=1,\"OK\",\"Please check data in Tab '\"&A4&\"'\")","v":"OK"}]
["5. Subcontracting Costs",{"$f":"IF(COUNTIF('5. Subcontracting Costs'!I:I,\"Error\")<=1,\"OK\",\"Please check data in Tab '\"&A5&\"'\")","v":"OK"}]
["Co-financing",{"$f":"IF(COUNTIF('Co-financing'!J:J,\"Error\")<=1,\"OK\",\"Please check data in Tab '\"&A6&\"'\")","v":"OK"}]
["Exceptional Travel Costs (EUR)",{"$f":"IF('2-3. Travel Costs&Costs of Stay'!K4=\"\",\"OK\",\"Please check Exceptional Travel Costs (EUR) in Tab '\"&A3&\"'\")","v":"OK"}]

{"sheet":"1. Staff costs","index":2,"n_rows":93,"n_cols":31,"rows_kept":93,"cut":false,"hidden":false,"merged":[[10,17,11,17],[3,5,8,19],[9,1,9,19],[2,1,2,19],[10,19,11,19],[1,1,1,19],[10,18,11,18],[10,5,10,7],[10,8,10,10],[10,11,10,13],[10,14,10,16],[10,1,11,1],[10,4,11,4],[10,3,11,3],[10,2,11,2],[7,1,7,2],[6,1,6,2],[5,1,5,2],[4,1,4,2],[3,1,3,2],[8,1,8,2]]}
[]
[null,"1. Staff Costs"]
[]
[null,null,null,"Total (EUR)","Number of Days"]
[null,"Manager",null,{"$f":"SUM(H:H)","v":120360},{"$f":"SUMIF(T:T,\"<>Error\",F:F)","v":971}]
[null,"Teacher/Trainer/Researcher",null,{"$f":"SUM(K:K)","v":156265},{"$f":"SUMIF(T:T,\"<>Error\",I:I)","v":1645}]
[null,"Technical Staff",null,{"$f":"SUM(N:N)","v":30410},{"$f":"SUMIF(T:T,\"<>Error\",L:L)","v":415}]
[null,"Administrative Staff",null,{"$f":"SUM(Q:Q)","v":12825},{"$f":"SUMIF(T:T,\"<>Error\",O:O)","v":285}]
[null,null,null,{"$f":"SUM(D5:D8)","v":319860},{"$f":"SUM(E5:E8)","v":3316}]
[]
{"$rows_left_out":84}
{"sheet":"2-3. Travel Costs&Costs of Stay","index":3,"n_rows":202,"n_cols":15,"rows_kept":202,"cut":false,"hidden":false,"merged":[[1,1,1,14],[10,5,11,5],[10,8,11,8],[10,7,11,7],[10,6,11,6],[10,4,11,4],[10,3,11,3],[10,13,11,13],[10,12,11,12],[10,11,11,11],[10,10,11,10],[10,9,11,9],[7,5,8,5],[5,5,6,5],[3,5,4,5],[10,1,11,1],[10,2,11,2],[8,1,8,2],[7,1,7,2],[6,1,6,2],[9,1,9,14],[10,14,11,14],[6,7,8,9],[5,7,5,9],[2,1,2,14],[7,4,8,4],[5,4,6,4],[3,4,4,4],[5,1,5,2],[4,1,4,2],[3,1,3,2],[3,7,3,8],[3,10,3,13]]}
[]
[null,"2-3. Travel Costs & Costs of Stay"]
[]
[null,"Travel Costs Student (EUR)",null,{"$f":"SUMIF(G:G,\"Student\",L:L)","v":15565},{"$f":"D4+D5","v":74570},{"$f":"SUMIFS(H:H,G:G,\"Student\",O:O,\"<>Error\")","v":64},null,"Exceptional Travel Costs (EUR)",null,7400,{"$f":"IF(AND(D8=0,J4>0),\"EXCEEDING 80% OF TOTAL TRAVEL COSTS\",IFERROR(IF(J4/D8>0.8,\"EXCEEDING 80% OF TOTAL TRAVEL COSTS\",\"\"),\"\"))","v":""}]
[null,"Costs of Stay Student (EUR)",null,{"$f":"SUMIF(G:G,\"Student\",M:M)","v":59005}]
[null,"Travel Costs Staff (EUR)",null,{"$f":"SUMIF(G:G,\"Staff\",L:L)","v":59960},{"$f":"D6+D7","v":217640},{"$f":"SUMIFS(H:H,G:G,\"Staff\",O:O,\"<>Error\")","v":300},null,"Exceptional Travel Costs\nPlease encode here above the estimated amount for exceptional travel costs. Please note that this amount will be added to the amount of travel costs forectasted for the Partner n°1"]
[null,"Costs of Stay Staff (EUR)",null,{"$f":"SUMIF(G:G,\"Staff\",M:M)","v":157680},null,null,null,"Please encode here above the estimated amount for exceptional travel costs. Please note that this amount will be added to the amount of travel costs of the Partner n°1."]
[null,"Total Travel Costs (EUR)",null,{"$f":"SUM(L:L)","v":75525},{"$f":"D8+D9","v":292210},{"$f":"F4+F6","v":364}]
[null,"Total Costs of Stay (EUR)",null,{"$f":"SUM(M:M)","v":216685}]
[]
{"$rows_left_out":193}
{"sheet":"4. Equipment Costs","index":4,"n_rows":19,"n_cols":9,"rows_kept":19,"cut":false,"hidden":false,"merged":[[0,1,0,8],[2,1,2,8],[9,1,9,8],[3,4,8,8],[10,8,11,8],[1,1,1,8],[10,7,11,7],[10,6,11,6],[10,5,11,5],[10,4,11,4],[3,1,8,1],[3,2,8,3],[10,3,11,3],[10,1,11,1],[10,2,11,2]]}
[]
[null,"4. Equipment Costs"]
[]
[null,"Total (EUR)",{"$f":"SUM(H:H)","v":209650}]
[]
[]
[]
[]
[]
[]
{"$rows_left_out":10}
{"sheet":"5. Subcontracting Costs","index":5,"n_rows":22,"n_cols":9,"rows_kept":22,"cut":false,"hidden":false,"merged":[[0,1,0,8],[10,8,11,8],[1,1,1,8],[10,7,11,7],[3,1,8,1],[3,2,8,3],[10,1,11,1],[10,2,11,2],[10,3,11,3],[10,4,11,4],[10,5,11,5],[10,6,11,6],[3,4,8,8],[2,1,2,8],[9,1,9,8]]}
[]
[null,"5. Subcontracting Costs"]
[]
[null,"Total (EUR)",{"$f":"SUM(H:H)","v":39000}]
[]
[]
[]
[]
[]
[]
{"$rows_left_out":13}
{"sheet":"Co-financing","index":6,"n_rows":33,"n_cols":10,"rows_kept":33,"cut":false,"hidden":false,"merged":[[0,1,0,9],[2,1,2,9],[9,1,9,9],[10,9,11,9],[1,1,1,9],[10,8,11,8],[10,5,11,5],[3,2,8,2],[3,1,8,1],[10,1,11,1],[10,2,11,2],[10,3,11,3],[10,6,11,6],[10,7,11,7],[10,4,11,4],[3,3,8,9]]}
[]
[null,"Information for the Co-financing"]
[]
[null,"Total (EUR)",{"$f":"SUM(I:I)","v":25100}]
[]
[]
[]
[]
[]
[]
{"$rows_left_out":24}
{"sheet":"Breakdown & Project Funding","index":7,"n_rows":77,"n_cols":9,"rows_kept":77,"cut":false,"hidden":false,"merged":[[19,1,19,8],[4,7,8,7],[0,1,0,8],[17,1,17,8],[12,1,12,8],[11,1,11,8],[18,1,18,8],[13,7,13,8],[14,7,14,8],[15,7,15,8],[16,7,16,8],[10,1,10,8],[2,1,2,8],[1,1,1,8]]}
[]
[null,"Budget Breakdown by Workpackage / Budget Headings"]
[]
[null,"Work\nPackage","1. Staff \nCosts","2. Travel \nCosts","3. Costs \nof Stay","4. Equipment\nCosts","5. Subcontracting\nCosts","a) Exceptional \nTravel Costs","Total\n(EUR)"]
[null,{"$f":"'Unit Costs & Funding Rule'!P10","v":"Preparation"},{"$f":"SUMIF('1. Staff costs'!B:B,B5,'1. Staff costs'!S:S)","v":41945},{"$f":"SUMIF('2-3. Travel Costs&Costs of Stay'!B:B,B5,'2-3. Travel Costs&Costs of Stay'!L:L)","v":7890},{"$f":"SUMIF('2-3. Travel Costs&Costs of Stay'!B:B,B5,'2-3. Travel Costs&Costs of Stay'!M:M)","v":16560},{"$f":"SUMIF('4. Equipment Costs'!B:B,B5,'4. Equipment Costs'!H:H)","v":0},{"$f":"SUMIF('5. Subcontracting Costs'!B:B,B5,'5. Subcontracting Costs'!H:H)","v":0},null,{"$f":"SUM(C5:G5)","v":66395}]
[null,{"$f":"'Unit Costs & Funding Rule'!P11","v":"Development"},{"$f":"SUMIF('1. Staff costs'!B:B,B6,'1. Staff costs'!S:S)","v":73131},{"$f":"SUMIF('2-3. Travel Costs&Costs of Stay'!B:B,B6,'2-3. Travel Costs&Costs of Stay'!L:L)","v":40205},{"$f":"SUMIF('2-3. Travel Costs&Costs of Stay'!B:B,B6,'2-3. Travel Costs&Costs of Stay'!M:M)","v":141600},{"$f":"SUMIF('4. Equipment Costs'!B:B,B6,'4. Equipment Costs'!H:H)","v":209650},{"$f":"SUMIF('5. Subcontracting Costs'!B:B,B6,'5. Subcontracting Costs'!H:H)","v":10000},null,{"$f":"SUM(C6:G6)","v":474586}]
[null,{"$f":"'Unit Costs & Funding Rule'!P12","v":"Quality Plan"},{"$f":"SUMIF('1. Staff costs'!B:B,B7,'1. Staff costs'!S:S)","v":20739},{"$f":"SUMIF('2-3. Travel Costs&Costs of Stay'!B:B,B7,'2-3. Travel Costs&Costs of Stay'!L:L)","v":1480},{"$f":"SUMIF('2-3. Travel Costs&Costs of Stay'!B:B,B7,'2-3. Travel Costs&Costs of Stay'!M:M)","v":2400},{"$f":"SUMIF('4. Equipment Costs'!B:B,B7,'4. Equipment Costs'!H:H)","v":0},{"$f":"SUMIF('5. Subcontracting Costs'!B:B,B7,'5. Subcontracting Costs'!H:H)","v":9000},null,33619]
[null,{"$f":"'Unit Costs & Funding Rule'!P13","v":"Dissemination & Exploitation"},{"$f":"SUMIF('1. Staff costs'!B:B,B8,'1. Staff costs'!S:S)","v":36610},{"$f":"SUMIF('2-3. Travel Costs&Costs of Stay'!B:B,B8,'2-3. Travel Costs&Costs of Stay'!L:L)","v":4190},{"$f":"SUMIF('2-3. Travel Costs&Costs of Stay'!B:B,B8,'2-3. Travel Costs&Costs of Stay'!M:M)","v":10285},{"$f":"SUMIF('4. Equipment Costs'!B:B,B8,'4. Equipment Costs'!H:H)","v":0},{"$f":"SUMIF('5. Subcontracting Costs'!B:B,B8,'5. Subcontracting Costs'!H:H)","v":5000},null,56085]
[null,{"$f":"'Unit Costs & Funding Rule'!P14","v":"Management"},{"$f":"SUMIF('1. Staff costs'!B:B,B9,'1. Staff costs'!S:S)","v":147435},{"$f":"SUMIF('2-3. Travel Costs&Costs of Stay'!B:B,B9,'2-3. Travel Costs&Costs of Stay'!L:L)","v":21760},{"$f":"SUMIF('2-3. Travel Costs&Costs of Stay'!B:B,B9,'2-3. Travel Costs&Costs of Stay'!M:M)","v":45840},{"$f":"SUMIF('4. Equipment Costs'!B:B,B9,'4. Equipment Costs'!H:H)","v":0},{"$f":"SUMIF('5. Subcontracting Costs'!B:B,B9,'5. Subcontracting Costs'!H:H)","v":15000},null,230035]
[null,"Total",{"$f":"SUM(C5:C9)","v":319860},75525,216685,209650,{"$f":"SUM(G5:G9)","v":39000},{"$f":"IF(OR(Overview!C26=\"\",Overview!D26=\"\"),0,'2-3. Travel Costs&Costs of Stay'!J4)","v":7400},{"$f":"SUM(C10:H10)","v":868120}]
{"$rows_left_out":68}
{"sheet":"Unit Costs & Funding Rule","index":8,"n_rows":186,"n_cols":19,"rows_kept":186,"cut":false,"hidden":false,"merged":[[0,1,0,20],[3,1,3,6],[3,8,3,9],[3,11,3,13],[3,15,3,16],[3,18,3,20],[6,15,6,16],[6,18,6,20],[4,1,5,6],[4,8,5,9],[4,11,5,13],[4,15,5,16],[4,18,5,20]]}
[null,"UNIT COSTS AND SUMMARY OF THE FUNDING RULES FOR  JOINT AND STRUCTURAL CAPACITY BUILDING PROJECTS\n\nYou can find below the unit costs values used in this file for the calculation of the grant.\nPlease refer to the Erasmus+ Programme guide 2017* for a complete overview of the funding rules applying to the Joint and Structural Capacity Building Projects (Part B of the guide and Annex 1)."]
[null,"* Link to Erasmus+ Programme guide 2018: ","https://ec.europa.eu/programmes/erasmus-plus/sites/erasmusplus2/files/files/resources/erasmus-plus-programme-guide_en.pdf"]
[null,"* Link to CBHE Call for proposal, forms, annexes and guidelines: ","https://eacea.ec.europa.eu/erasmus-plus/funding/capacity-building-higher-education-2018_en"]
[null,"A.1 Staff Costs",null,null,null,null,null,null,"A.2 & B Travel Costs",null,null,"A. 3 Costs of Stay",null,null,null,"A.4 Equipment",null,null,"A.5 Subcontracting"]
[null,"Unit costs\n\nContribution to the costs of staff performing tasks which are directly necessary to the achievements of the project's objectives.\n\nConditional: applicants will have to justify the type and volume of resources needed in relation to the implementation of the proposed activities and outputs. The contribution is provided on the  condition that the salary for the same tasks is compensated only once.",null,null,null,null,null,null,"Unit costs based on the travel distance per participant. \n\nTravel distances must be calculated using the distance calculator supported by the European Commission . \nThe applicant must indicate the distance of a one-way travel to calculate the amount of the EU grant that will support the round trip.",null,null,"Costs for subsistence, accommodation, local and public transport such as bus and taxi, personal or optional health insurance.\n\nUnit costs based on the duration of the stay of the participants:\n\nStaff: \n120 EUR/day from day 1 to day 14\n70 EUR/day from day 15 to day 60\n50 EUR/day from day 61 to day 90 (the maximum)\n\nStudent: \n55 EUR/day from day 1 to day 14\n40 EUR/day from day 15 to max day 90 (the maximum)",null,null,null,"Contribution for the purchase of equipment necessary for the implementation of the project. Support is provided only for equipment purchased for the benefit of the HEIs in the Partner Countries. \n\nConditional: the request for financial support to cover these costs must be motivated in the application form",null,null,"Support for sub-contracting costs that are necessary to the implementation of the project, including, in particular, costs for the compulsory financial audits (audit certificate) and for any external quality assurance procedure.\n\nSub-contracting for project-management-related tasks is not eligible.\n\nSub-contracting to external bodies should be very occasional. The specific competences and particular expertise needed to reach the project objectives should be found in the consortium and should determine its composition."]
[]
[null,"Country","PR/PA","Manager","Teacher/Trainer/Researcher","Technical Staff","Administrative Staff",null,"Distance","Travel \nCosts\n(EUR)",null,"Number of \nDays","Student","Staff",null,"100% of eligible costs\nMax. 30% of the total grant",null,null,"100% of eligible costs\nMax. 10% of the total grant"]
[null,"Austria","Programme Countries",294,241,190,157,null,"0 KM and 9 KM",0,null,1,{"$f":"L8*55","v":55},{"$f":"L8*120","v":120}]
[null,"Belgium","Programme Countries",280,214,162,131,null,"10 KM and 99 KM",20,null,2,{"$f":"L9*55","v":110},{"$f":"L9*120","v":240},null,"WorkPackage"]
[null,"Bulgaria","Programme Countries",88,74,55,39,null,"100 KM and 499 KM",180,null,3,165,360,null,"Preparation"]
{"$rows_left_out":176}